Reaction Details
TargetCalcitonin gene-related peptide type 1 receptor
LigandBDBM50302893
Substrate/Competitorn/a
Meas. Tech.ChEMBL_595485 (CHEMBL1046104)
Ki 390±n/a nM
Citation Burgey, CSPotteiger, CMDeng, JZMosser, SDSalvatore, CAYu, SRoller, SKane, SAVacca, JPWilliams, TM Optimization of azepanone calcitonin gene-related peptide (CGRP) receptor antagonists: development of novel spiropiperidines. Bioorg Med Chem Lett19:6368-72 (2009) 
 
Calcitonin gene-related peptide type 1 receptor
Name:Calcitonin gene-related peptide type 1 receptor
Type:Enzyme Catalytic Domain
Mol. Mass.:52980.45
Organism:Homo sapiens (Human)
Description:Q16602
Residue:461
BDBM50302893
NameBDBM50302893
Synonyms:CHEMBL570527 | N-((3R,6S)-6-(2,3-difluorophenyl)-2-oxo-1-(2,2,2-trifluoroethyl)azepan-3-yl)-8,10-dioxo-3,9-diazaspiro[5.5]undecane-3-carboxamide
TypeSmall organic molecule
Emp. Form.C24H27F5N4O4
Mol. Mass.530.4876
SMILESFc1cccc([C@@H]2CC[C@@H](NC(=O)N3CCC4(CC3)CC(=O)NC(=O)C4)C(=O)N(CC(F)(F)F)C2)c1F