Reaction Details
TargetCalcitonin gene-related peptide type 1 receptor
LigandBDBM50302881
Substrate/Competitorn/a
Meas. Tech.ChEMBL_595485 (CHEMBL1046104)
Ki 1.1±n/a nM
Citation Burgey, CSPotteiger, CMDeng, JZMosser, SDSalvatore, CAYu, SRoller, SKane, SAVacca, JPWilliams, TM Optimization of azepanone calcitonin gene-related peptide (CGRP) receptor antagonists: development of novel spiropiperidines. Bioorg Med Chem Lett19:6368-72 (2009) 
 
Calcitonin gene-related peptide type 1 receptor
Name:Calcitonin gene-related peptide type 1 receptor
Type:Enzyme Catalytic Domain
Mol. Mass.:52980.45
Organism:Homo sapiens (Human)
Description:Q16602
Residue:461
BDBM50302881
NameBDBM50302881
Synonyms:CHEMBL570746 | N-((3R,6S)-6-(2,3-difluorophenyl)-2-oxo-1-(2,2,2-trifluoroethyl)azepan-3-yl)-2'-oxo-1',2'-dihydrospiro[piperidine-4,4'-pyrido[2,3-d][1,3]oxazine]-1-carboxamide
TypeSmall organic molecule
Emp. Form.C26H26F5N5O4
Mol. Mass.567.5078
SMILESFc1cccc([C@@H]2CC[C@@H](NC(=O)N3CCC4(CC3)OC(=O)Nc3ncccc43)C(=O)N(CC(F)(F)F)C2)c1F