Reaction Details
TargetSerine/threonine-protein kinase B-raf
LigandBDBM50303095
Substrate/Competitorn/a
Meas. Tech.ChEMBL_597720 (CHEMBL1043507)
IC50 70.8±n/a nM
Citation Di Grandi, MJBerger, DMHopper, DWZhang, CDutia, MDunnick, ALTorres, NLevin, JIDiamantidis, GZapf, CWBloom, JDHu, YPowell, DWojciechowicz, DCollins, KFrommer, E Novel pyrazolopyrimidines as highly potent B-Raf inhibitors. Bioorg Med Chem Lett19:6957-61 (2009) 
 
Serine/threonine-protein kinase B-raf
Name:Serine/threonine-protein kinase B-raf
Type:Serine/threonine-protein kinase
Mol. Mass.:84446.00
Organism:Homo sapiens (Human)
Description:P15056
Residue:766
BDBM50303095
NameBDBM50303095
Synonyms:7-(8-azabicyclo[3.2.1]octan-3-yl)-3-(3-methoxyphenyl)-2-(pyridin-4-yl)-1,2-dihydropyrazolo[1,5-a]pyrimidine | CHEMBL569735
TypeSmall organic molecule
Emp. Form.C25H25N5O
Mol. Mass.411.4989
SMILESCOc1cccc(c1)-c1c(nn2c(ccnc12)C1CC2CCC(C1)N2)-c1ccncc1