Reaction Details
TargetSerine/threonine-protein kinase B-raf
LigandBDBM50303102
Substrate/Competitorn/a
Meas. Tech.ChEMBL_597720 (CHEMBL1043507)
IC50 3±n/a nM
Citation Di Grandi, MJBerger, DMHopper, DWZhang, CDutia, MDunnick, ALTorres, NLevin, JIDiamantidis, GZapf, CWBloom, JDHu, YPowell, DWojciechowicz, DCollins, KFrommer, E Novel pyrazolopyrimidines as highly potent B-Raf inhibitors. Bioorg Med Chem Lett19:6957-61 (2009) 
 
Serine/threonine-protein kinase B-raf
Name:Serine/threonine-protein kinase B-raf
Type:Serine/threonine-protein kinase
Mol. Mass.:84446.00
Organism:Homo sapiens (Human)
Description:P15056
Residue:766
BDBM50303102
NameBDBM50303102
Synonyms:5-(7-(8-ethyl-8-azabicyclo[3.2.1]octan-3-yl)-2-(pyridin-4-yl)-1,2-dihydropyrazolo[1,5-a]pyrimidin-3-yl)-2-fluorophenol | CHEMBL568855
TypeSmall organic molecule
Emp. Form.C26H26FN5O
Mol. Mass.443.5159
SMILESCCN1C2CCC1CC(C2)c1ccnc2c(c(nn12)-c1ccncc1)-c1ccc(F)c(O)c1