Reaction Details
TargetSerine/threonine-protein kinase B-raf
LigandBDBM50303117
Substrate/Competitorn/a
Meas. Tech.ChEMBL_597720 (CHEMBL1043507)
IC50 39.4±n/a nM
Citation Di Grandi, MJBerger, DMHopper, DWZhang, CDutia, MDunnick, ALTorres, NLevin, JIDiamantidis, GZapf, CWBloom, JDHu, YPowell, DWojciechowicz, DCollins, KFrommer, E Novel pyrazolopyrimidines as highly potent B-Raf inhibitors. Bioorg Med Chem Lett19:6957-61 (2009) 
 
Serine/threonine-protein kinase B-raf
Name:Serine/threonine-protein kinase B-raf
Type:Serine/threonine-protein kinase
Mol. Mass.:84446.00
Organism:Homo sapiens (Human)
Description:P15056
Residue:766
BDBM50303117
NameBDBM50303117
Synonyms:(2R)-tert-butyl 1-(3-(3-(1H-indazol-4-yl)-2-(pyridin-4-yl)-1,2-dihydropyrazolo[1,5-a]pyrimidin-7-yl)-8-azabicyclo[3.2.1]octane-8-carbonyl)pyrrolidine-2-carboxylate | CHEMBL571747
TypeSmall organic molecule
Emp. Form.C35H38N8O3
Mol. Mass.618.728
SMILESCC(C)(C)OC(=O)[C@H]1CCCN1C(=O)N1C2CCC1CC(C2)c1ccnc2c(c(nn12)-c1ccncc1)-c1cccc2[nH]ncc12