Reaction Details
TargetDual specificity protein phosphatase 1
LigandBDBM50303175
Substrate/Competitorn/a
Meas. Tech.ChEMBL_595101 (CHEMBL1047961)
IC50 780±n/a nM
Citation Wu, SVossius, SRahmouni, SMiletic, AVVang, TVazquez-Rodriguez, JCerignoli, FArimura, YWilliams, SHayes, TMoutschen, MVasile, SPellecchia, MMustelin, TTautz, L Multidentate small-molecule inhibitors of vaccinia H1-related (VHR) phosphatase decrease proliferation of cervix cancer cells. J Med Chem52:6716-23 (2009) 
 
Dual specificity protein phosphatase 1
Name:Dual specificity protein phosphatase 1
Type:Protein phosphatase
Mol. Mass.:39301.48
Organism:Homo sapiens (Human)
Description:gi_4758204
Residue:367
BDBM50303175
NameBDBM50303175
Synonyms:2-(5-((3-(4-(benzyloxy)phenyl)-1-phenyl-1H-pyrazol-4-yl)methylene)-4-oxo-2-thioxothiazolidin-3-yl)ethanesulfonic acid cid_4050965
TypeSmall organic molecule
Emp. Form.C28H23N3O5S3
Mol. Mass.577.694
SMILESOS(=O)(=O)CCN1C(=S)S\C(=C/c2cn(nc2-c2ccc(OCc3ccccc3)cc2)-c2ccccc2)C1=O