Reaction Details
TargetDual specificity protein phosphatase 1
LigandBDBM28884
Substrate/Competitorn/a
Meas. Tech.ChEMBL_595101 (CHEMBL1047961)
IC50 2800±n/a nM
Citation Wu, SVossius, SRahmouni, SMiletic, AVVang, TVazquez-Rodriguez, JCerignoli, FArimura, YWilliams, SHayes, TMoutschen, MVasile, SPellecchia, MMustelin, TTautz, L Multidentate small-molecule inhibitors of vaccinia H1-related (VHR) phosphatase decrease proliferation of cervix cancer cells. J Med Chem52:6716-23 (2009) 
 
Dual specificity protein phosphatase 1
Name:Dual specificity protein phosphatase 1
Type:Protein phosphatase
Mol. Mass.:39301.48
Organism:Homo sapiens (Human)
Description:gi_4758204
Residue:367
BDBM28884
NameBDBM28884
Synonyms:2-[(5Z)-4-oxo-5-({1-phenyl-3-[4-(piperidine-1-sulfonyl)phenyl]-1H-pyrazol-4-yl}methylidene)-2-sulfanylidene-1,3-thiazolidin-3-yl]ethane-1-sulfonic acid | rhodanine derivative, 43
TypeSmall organic molecule
Emp. Form.C26H26N4O6S4
Mol. Mass.618.768
SMILESOS(=O)(=O)CCN1C(=S)S\C(=C/c2cn(nc2-c2ccc(cc2)S(=O)(=O)N2CCCCC2)-c2ccccc2)C1=O