Reaction Details
TargetSodium/glucose cotransporter 2
LigandBDBM50303254
Substrate/Competitorn/a
Meas. Tech.ChEMBL_595350 (CHEMBL1050643)
IC50 0.8±n/a nM
Citation Lv, BXu, BFeng, YPeng, KXu, GDu, JZhang, LZhang, WZhang, TZhu, LDing, HSheng, ZWelihinda, ASeed, BChen, Y Exploration of O-spiroketal C-arylglucosides as novel and selective renal sodium-dependent glucose co-transporter 2 (SGLT2) inhibitors. Bioorg Med Chem Lett19:6877-81 (2009) 
 
Sodium/glucose cotransporter 2
Name:Sodium/glucose cotransporter 2
Type:Protein
Mol. Mass.:72902.00
Organism:Homo sapiens (Human)
Description:P31639
Residue:672
BDBM50303254
NameBDBM50303254
Synonyms:(1S,3'R,4'S,5'S,6'R)-5-chloro-6-(2-fluoro-3-methylbenzyl)-6'-(hydroxymethyl)-3',4',5',6'-tetrahydro-3H-spiro[isobenzofuran-1,2'-pyran]-3',4',5'-triol | CHEMBL565377
TypeSmall organic molecule
Emp. Form.C21H22ClFO6
Mol. Mass.424.847
SMILESCc1cccc(Cc2cc3c(CO[C@]33O[C@H](CO)[C@@H](O)[C@H](O)[C@H]3O)cc2Cl)c1F