Reaction Details
TargetVascular endothelial growth factor receptor 2
LigandBDBM50303262
Substrate/Competitorn/a
Meas. Tech.ChEMBL_595361 (CHEMBL1050654)
IC50 4±n/a nM
Citation Saavedra, OClaridge, SZhan, LRaeppel, FGranger, MCRaeppel, SMannion, MGaudette, FZhou, NIsakovic, LBernstein, NDéziel, RNguyen, HBeaulieu, NBeaulieu, CDupont, IWang, JMacleod, ARBesterman, JMVaisburg, A N3-arylmalonamides: a new series of thieno[3,2-b]pyridine based inhibitors of c-Met and VEGFR2 tyrosine kinases. Bioorg Med Chem Lett19:6836-9 (2009) 
 
Vascular endothelial growth factor receptor 2
Name:Vascular endothelial growth factor receptor 2
Type:Receptor Tyrosine Kinase
Mol. Mass.:151510.97
Organism:Homo sapiens (Human)
Description:P35968
Residue:1356
BDBM50303262
NameBDBM50303262
Synonyms:CHEMBL566010 | N1-(3-fluoro-4-(2-(pyrrolidine-1-carbonyl)thieno[3,2-b]pyridin-7-yloxy)phenyl)-N3-phenylmalonamide
TypeSmall organic molecule
Emp. Form.C27H23FN4O4S
Mol. Mass.518.559
SMILESFc1cc(NC(=O)CC(=O)Nc2ccccc2)ccc1Oc1ccnc2cc(sc12)C(=O)N1CCCC1