Reaction Details
TargetVascular endothelial growth factor receptor 2
LigandBDBM50303277
Substrate/Competitorn/a
Meas. Tech.ChEMBL_595361 (CHEMBL1050654)
IC50 6±n/a nM
Citation Saavedra, OClaridge, SZhan, LRaeppel, FGranger, MCRaeppel, SMannion, MGaudette, FZhou, NIsakovic, LBernstein, NDéziel, RNguyen, HBeaulieu, NBeaulieu, CDupont, IWang, JMacleod, ARBesterman, JMVaisburg, A N3-arylmalonamides: a new series of thieno[3,2-b]pyridine based inhibitors of c-Met and VEGFR2 tyrosine kinases. Bioorg Med Chem Lett19:6836-9 (2009) 
 
Vascular endothelial growth factor receptor 2
Name:Vascular endothelial growth factor receptor 2
Type:Receptor Tyrosine Kinase
Mol. Mass.:151510.97
Organism:Homo sapiens (Human)
Description:P35968
Residue:1356
BDBM50303277
NameBDBM50303277
Synonyms:CHEMBL565782 | N1-(4-(2-(1-ethyl-1H-imidazole-4-carbonyl)thieno[3,2-b]pyridin-7-yloxy)-3-fluorophenyl)-N3-methyl-N3-phenylmalonamide
TypeSmall organic molecule
Emp. Form.C28H24FN5O3S
Mol. Mass.529.585
SMILESCCn1cnc(c1)-c1cc2nccc(Oc3ccc(NC(=O)CC(=O)N(C)c4ccccc4)cc3F)c2s1