Reaction Details
TargetSerine/threonine-protein kinase mTOR
LigandBDBM50303288
Substrate/Competitorn/a
Meas. Tech.ChEMBL_595396 (CHEMBL1039195)
IC50 0.3±n/a nM
Citation Richard, DJVerheijen, JCCurran, KKaplan, JToral-Barza, LHollander, ILucas, JYu, KZask, A Incorporation of water-solubilizing groups in pyrazolopyrimidine mTOR inhibitors: discovery of highly potent and selective analogs with improved human microsomal stability. Bioorg Med Chem Lett19:6830-5 (2009) 
 
Serine/threonine-protein kinase mTOR
Name:Serine/threonine-protein kinase mTOR
Type:Rapamycin target protein
Mol. Mass.:288917.12
Organism:Homo sapiens (Human)
Description:P42345
Residue:2549
BDBM50303288
NameBDBM50303288
Synonyms:1-(4-(4-(8-oxa-3-azabicyclo[3.2.1]octan-3-yl)-1-ethyl-1H-pyrazolo[3,4-d]pyrimidin-6-yl)phenyl)-3-phenylurea | CHEMBL565787
TypeSmall organic molecule
Emp. Form.C26H27N7O2
Mol. Mass.469.5383
SMILESCCn1ncc2c(nc(nc12)-c1ccc(NC(=O)Nc2ccccc2)cc1)N1CC2CCC(C1)O2