Reaction Details
TargetAngiotensin-converting enzyme
LigandBDBM50303328
Substrate/Competitorn/a
Meas. Tech.ChEMBL_595724 (CHEMBL1045247)
Ki 3.8±n/a nM
Citation Jullien, NMakritis, AGeorgiadis, DBeau, FYiotakis, ADive, V Phosphinic tripeptides as dual angiotensin-converting enzyme C-domain and endothelin-converting enzyme-1 inhibitors. J Med Chem53:208-20 (2010) 
 
Angiotensin-converting enzyme
Name:Angiotensin-converting enzyme
Type:Enzyme
Mol. Mass.:149709.01
Organism:Homo sapiens (Human)
Description:n/a
Residue:1306
BDBM50303328
NameBDBM50303328
Synonyms:(2S)-2-({3-[Hydroxyl(2-phenyl-(1R)-1{[(benzyloxy)carbonyl]amino}ethyl)Phosphinyl]-(2S)-2-[(3-phenylisoxazol-5-yl)methyl]-1-oxopropyl}amino)-3-phenyl Propanoic Acid | CHEMBL567628
TypeSmall organic molecule
Emp. Form.C38H38N3O8P
Mol. Mass.695.6974
SMILESOC(=O)[C@H](Cc1ccccc1)NC(=O)[C@@H](Cc1cc(no1)-c1ccccc1)CP(O)(=O)[C@H](Cc1ccccc1)NC(=O)OCc1ccccc1