Reaction Details
TargetNeutrophil elastase
LigandBDBM50303356
Substrate/Competitorn/a
Meas. Tech.ChEMBL_595760 (CHEMBL1045283)
Ki 2.2±n/a nM
Citation Mulchande, JOliveira, RCarrasco, MGouveia, LGuedes, RCIley, JMoreira, R 4-Oxo-beta-lactams (azetidine-2,4-diones) are potent and selective inhibitors of human leukocyte elastase. J Med Chem53:241-53 (2010) 
 
Neutrophil elastase
Name:Neutrophil elastase
Type:Enzyme
Mol. Mass.:28532.38
Organism:Homo sapiens (Human)
Description:P08246
Residue:267
BDBM50303356
NameBDBM50303356
Synonyms:3,3-Diethyl-1-(pyridin-3-yl)azetidine-2,4-dione | CHEMBL566906
TypeSmall organic molecule
Emp. Form.C12H14N2O2
Mol. Mass.218.2518
SMILESCCC1(CC)C(=O)N(C1=O)c1cccnc1