Reaction Details
TargetNeutrophil elastase
LigandBDBM50303359
Substrate/Competitorn/a
Meas. Tech.ChEMBL_595760 (CHEMBL1045283)
Ki 114±n/a nM
Citation Mulchande, JOliveira, RCarrasco, MGouveia, LGuedes, RCIley, JMoreira, R 4-Oxo-beta-lactams (azetidine-2,4-diones) are potent and selective inhibitors of human leukocyte elastase. J Med Chem53:241-53 (2010) 
 
Neutrophil elastase
Name:Neutrophil elastase
Type:Enzyme
Mol. Mass.:28532.38
Organism:Homo sapiens (Human)
Description:P08246
Residue:267
BDBM50303359
NameBDBM50303359
Synonyms:1-benzyl-3,3-diethylazetidine-2,4-dione | CHEMBL271819
TypeSmall organic molecule
Emp. Form.C14H17NO2
Mol. Mass.231.2903
SMILESCCC1(CC)C(=O)N(Cc2ccccc2)C1=O