Reaction Details
TargetNeutrophil elastase
LigandBDBM50235616
Substrate/Competitorn/a
Meas. Tech.ChEMBL_595760 (CHEMBL1045283)
Ki 23.8±n/a nM
Citation Mulchande, JOliveira, RCarrasco, MGouveia, LGuedes, RCIley, JMoreira, R 4-Oxo-beta-lactams (azetidine-2,4-diones) are potent and selective inhibitors of human leukocyte elastase. J Med Chem53:241-53 (2010) 
 
Neutrophil elastase
Name:Neutrophil elastase
Type:Enzyme
Mol. Mass.:28532.38
Organism:Homo sapiens (Human)
Description:P08246
Residue:267
BDBM50235616
NameBDBM50235616
Synonyms:1-(4-chlorophenyl)-3,3-dimethylazetidine-2,4-dione | CHEMBL270993
TypeSmall organic molecule
Emp. Form.C11H10ClNO2
Mol. Mass.223.656
SMILESCC1(C)C(=O)N(C1=O)c1ccc(Cl)cc1