Reaction Details
TargetNeutrophil elastase
LigandBDBM50303370
Substrate/Competitorn/a
Meas. Tech.ChEMBL_595760 (CHEMBL1045283)
Ki 1.1±n/a nM
Citation Mulchande, JOliveira, RCarrasco, MGouveia, LGuedes, RCIley, JMoreira, R 4-Oxo-beta-lactams (azetidine-2,4-diones) are potent and selective inhibitors of human leukocyte elastase. J Med Chem53:241-53 (2010) 
 
Neutrophil elastase
Name:Neutrophil elastase
Type:Enzyme
Mol. Mass.:28532.38
Organism:Homo sapiens (Human)
Description:P08246
Residue:267
BDBM50303370
NameBDBM50303370
Synonyms:1-(4-((5-Phenyl-1,3,4-oxadiazol-2-ylthio)methyl)phenyl)-3,3-diethylazetidine-2,4-dione | CHEMBL567542
TypeSmall organic molecule
Emp. Form.C22H21N3O3S
Mol. Mass.407.485
SMILESCCC1(CC)C(=O)N(C1=O)c1ccc(CSc2nnc(o2)-c2ccccc2)cc1