Reaction Details
TargetCruzipain
LigandBDBM50303420
Substrate/Competitorn/a
Meas. Tech.ChEMBL_595795 (CHEMBL1048802)
IC50 0.2±n/a nM
Citation Mott, BTFerreira, RSSimeonov, AJadhav, AAng, KKLeister, WShen, MSilveira, JTDoyle, PSArkin, MRMcKerrow, JHInglese, JAustin, CPThomas, CJShoichet, BKMaloney, DJ Identification and optimization of inhibitors of Trypanosomal cysteine proteases: cruzain, rhodesain, and TbCatB. J Med Chem53:52-60 (2010) 
 
Cruzipain
Name:Cruzipain
Type:Protein
Mol. Mass.:49831.41
Organism:Trypanosoma cruzi
Description:P25779
Residue:467
BDBM50303420
NameBDBM50303420
Synonyms:6-(3,5-Difluorophenylamino)-9-ethyl-9H-purine-2-carbonitrile CHEMBL567341
TypeSmall organic molecule
Emp. Form.C14H10F2N6
Mol. Mass.300.2662
SMILESCCn1cnc2c(Nc3cc(F)cc(F)c3)nc(nc12)C#N