Reaction Details
TargetCaspase-14
LigandBDBM50303417
Substrate/Competitorn/a
Meas. Tech.ChEMBL_595880 (CHEMBL1040860)
IC50 9120.11±n/a nM
Citation Mott, BTFerreira, RSSimeonov, AJadhav, AAng, KKLeister, WShen, MSilveira, JTDoyle, PSArkin, MRMcKerrow, JHInglese, JAustin, CPThomas, CJShoichet, BKMaloney, DJ Identification and optimization of inhibitors of Trypanosomal cysteine proteases: cruzain, rhodesain, and TbCatB. J Med Chem53:52-60 (2010) 
 
Caspase-14
Name:Caspase-14
Type:PROTEIN
Mol. Mass.:27674.68
Organism:Homo sapiens (Human)
Description:ChEMBL_595880
Residue:242
BDBM50303417
NameBDBM50303417
Synonyms:4-(Cyclopentylamino)-6-(3,5-difluorophenylamino)-1,3,5-triazine-2-carbonitrile | CHEMBL568171
TypeSmall organic molecule
Emp. Form.C15H14F2N6
Mol. Mass.316.3087
SMILESFc1cc(F)cc(Nc2nc(NC3CCCC3)nc(n2)C#N)c1