Reaction Details
TargetPapain
LigandBDBM50303417
Substrate/Competitorn/a
Meas. Tech.ChEMBL_595888 (CHEMBL1040868)
IC50 389.05±n/a nM
Citation Mott, BTFerreira, RSSimeonov, AJadhav, AAng, KKLeister, WShen, MSilveira, JTDoyle, PSArkin, MRMcKerrow, JHInglese, JAustin, CPThomas, CJShoichet, BKMaloney, DJ Identification and optimization of inhibitors of Trypanosomal cysteine proteases: cruzain, rhodesain, and TbCatB. J Med Chem53:52-60 (2010) 
 
Papain
Name:Papain
Type:Enzyme
Mol. Mass.:38923.01
Organism:Carica papaya
Description:Papain was purchased from Sigma, Germany.
Residue:345
BDBM50303417
NameBDBM50303417
Synonyms:4-(Cyclopentylamino)-6-(3,5-difluorophenylamino)-1,3,5-triazine-2-carbonitrile | CHEMBL568171
TypeSmall organic molecule
Emp. Form.C15H14F2N6
Mol. Mass.316.3087
SMILESFc1cc(F)cc(Nc2nc(NC3CCCC3)nc(n2)C#N)c1