Reaction Details
TargetCathepsin Z
LigandBDBM50303410
Substrate/Competitorn/a
Meas. Tech.ChEMBL_595889 (CHEMBL1040869)
IC50 6456.54±n/a nM
Citation Mott, BTFerreira, RSSimeonov, AJadhav, AAng, KKLeister, WShen, MSilveira, JTDoyle, PSArkin, MRMcKerrow, JHInglese, JAustin, CPThomas, CJShoichet, BKMaloney, DJ Identification and optimization of inhibitors of Trypanosomal cysteine proteases: cruzain, rhodesain, and TbCatB. J Med Chem53:52-60 (2010) 
 
Cathepsin Z
Name:Cathepsin Z
Type:PROTEIN
Mol. Mass.:33870.59
Organism:Homo sapiens (Human)
Description:ChEMBL_595889
Residue:303
BDBM50303410
NameBDBM50303410
Synonyms:4-(3-chlorophenylamino)-6-(cyclopentylamino)-1,3,5-triazine-2-carbonitrile | CHEMBL567785
TypeSmall organic molecule
Emp. Form.C15H15ClN6
Mol. Mass.314.773
SMILESClc1cccc(Nc2nc(NC3CCCC3)nc(n2)C#N)c1