Reaction Details
Target3-dehydroquinate dehydratase
LigandBDBM50303444
Substrate/Competitorn/a
Meas. Tech.ChEMBL_595938 (CHEMBL1041787)
Ki 130±n/a nM
Citation Prazeres, VFTizón, LOtero, JMGuardado-Calvo, PLlamas-Saiz, ALvan Raaij, MJCastedo, LLamb, HHawkins, ARGonzález-Bello, C Synthesis and biological evaluation of new nanomolar competitive inhibitors of Helicobacter pylori type II dehydroquinase. Structural details of the role of the aromatic moieties with essential residues. J Med Chem53:191-200 (2010) 
 
3-dehydroquinate dehydratase
Name:3-dehydroquinate dehydratase
Type:PROTEIN
Mol. Mass.:18479.08
Organism:Helicobacter pylori
Description:ChEMBL_766424
Residue:167
BDBM50303444
NameBDBM50303444
Synonyms:CHEMBL567564 | Sodium(1R,4S,5R)-1,4,5-Trihydroxy-3-(5-methylbenzo[b]-thiophen-2-yl)methoxycyclohexan-1-carboxylate
TypeSmall organic molecule
Emp. Form.C17H17O6S
Mol. Mass.349.379
SMILESCc1ccc2sc(COC3=C[C@](O)(C[C@@H](O)[C@@H]3O)C([O-])=O)cc2c1