Reaction Details
TargetCannabinoid receptor 2
LigandBDBM50303540
Substrate/Competitorn/a
Meas. Tech.ChEMBL_596087 (CHEMBL1040875)
Ki 30±n/a nM
Citation Frost, JMDart, MJTietje, KRGarrison, TRGrayson, GKDaza, AVEl-Kouhen, OFYao, BBHsieh, GCPai, MZhu, CZChandran, PMeyer, MD Indol-3-ylcycloalkyl ketones: effects of N1 substituted indole side chain variations on CB(2) cannabinoid receptor activity. J Med Chem53:295-315 (2010) 
 
Cannabinoid receptor 2
Name:Cannabinoid receptor 2
Type:G Protein-Coupled Receptor (GPCR)
Mol. Mass.:39690.94
Organism:Homo sapiens (Human)
Description:P34972
Residue:360
BDBM50303540
NameBDBM50303540
Synonyms:(1-(Pyridin-3-ylmethyl)-1H-indol-3-yl)(2,2,3,3-tetramethylcyclopropyl)methanone | CHEMBL578178
TypeSmall organic molecule
Emp. Form.C22H24N2O
Mol. Mass.332.4388
SMILESCC1(C)C(C(=O)c2cn(Cc3cccnc3)c3ccccc23)C1(C)C