Reaction Details
TargetCannabinoid receptor 2
LigandBDBM50303537
Substrate/Competitorn/a
Meas. Tech.ChEMBL_596087 (CHEMBL1040875)
Ki 2.9±n/a nM
Citation Frost, JMDart, MJTietje, KRGarrison, TRGrayson, GKDaza, AVEl-Kouhen, OFYao, BBHsieh, GCPai, MZhu, CZChandran, PMeyer, MD Indol-3-ylcycloalkyl ketones: effects of N1 substituted indole side chain variations on CB(2) cannabinoid receptor activity. J Med Chem53:295-315 (2010) 
 
Cannabinoid receptor 2
Name:Cannabinoid receptor 2
Type:G Protein-Coupled Receptor (GPCR)
Mol. Mass.:39690.94
Organism:Homo sapiens (Human)
Description:P34972
Residue:360
BDBM50303537
NameBDBM50303537
Synonyms:CHEMBL570877 | Methyl 3-(3-(2,2,3,3-Tetramethylcyclopropanecarbonyl)-1Hindol-1-yl)propanoate
TypeSmall organic molecule
Emp. Form.C20H25NO3
Mol. Mass.327.4174
SMILESCOC(=O)CCn1cc(C(=O)C2C(C)(C)C2(C)C)c2ccccc12