Reaction Details
TargetCannabinoid receptor 2
LigandBDBM50303527
Substrate/Competitorn/a
Meas. Tech.ChEMBL_596087 (CHEMBL1040875)
Ki 0.09±n/a nM
Citation Frost, JMDart, MJTietje, KRGarrison, TRGrayson, GKDaza, AVEl-Kouhen, OFYao, BBHsieh, GCPai, MZhu, CZChandran, PMeyer, MD Indol-3-ylcycloalkyl ketones: effects of N1 substituted indole side chain variations on CB(2) cannabinoid receptor activity. J Med Chem53:295-315 (2010) 
 
Cannabinoid receptor 2
Name:Cannabinoid receptor 2
Type:G Protein-Coupled Receptor (GPCR)
Mol. Mass.:39690.94
Organism:Homo sapiens (Human)
Description:P34972
Residue:360
BDBM50303527
NameBDBM50303527
Synonyms:(2,2,3,3-Tetramethylcyclopropyl)(1-(4,4,4-trifluorobutyl)-1Hindol-3-yl)methanone | CHEMBL569082
TypeSmall organic molecule
Emp. Form.C20H24F3NO
Mol. Mass.351.4059
SMILESCC1(C)C(C(=O)c2cn(CCCC(F)(F)F)c3ccccc23)C1(C)C