Reaction Details
TargetCannabinoid receptor 2
LigandBDBM50303534
Substrate/Competitorn/a
Meas. Tech.ChEMBL_596090 (CHEMBL1040878)
EC50 22±n/a nM
Citation Frost, JMDart, MJTietje, KRGarrison, TRGrayson, GKDaza, AVEl-Kouhen, OFYao, BBHsieh, GCPai, MZhu, CZChandran, PMeyer, MD Indol-3-ylcycloalkyl ketones: effects of N1 substituted indole side chain variations on CB(2) cannabinoid receptor activity. J Med Chem53:295-315 (2010) 
 
Cannabinoid receptor 2
Name:Cannabinoid receptor 2
Type:G Protein-Coupled Receptor (GPCR)
Mol. Mass.:39690.94
Organism:Homo sapiens (Human)
Description:P34972
Residue:360
BDBM50303534
NameBDBM50303534
Synonyms:(1-(4-(Methylthio)butyl)-1H-indol-3-yl)(2,2,3,3-tetramethylcyclopropyl)methanone | CHEMBL569301
TypeSmall organic molecule
Emp. Form.C21H29NOS
Mol. Mass.343.526
SMILESCSCCCCn1cc(C(=O)C2C(C)(C)C2(C)C)c2ccccc12