Reaction Details
TargetCannabinoid receptor 1
LigandBDBM50303551
Substrate/Competitorn/a
Meas. Tech.ChEMBL_596092 (CHEMBL1040880)
EC50 3593±n/a nM
Citation Frost, JMDart, MJTietje, KRGarrison, TRGrayson, GKDaza, AVEl-Kouhen, OFYao, BBHsieh, GCPai, MZhu, CZChandran, PMeyer, MD Indol-3-ylcycloalkyl ketones: effects of N1 substituted indole side chain variations on CB(2) cannabinoid receptor activity. J Med Chem53:295-315 (2010) 
 
Cannabinoid receptor 1
Name:Cannabinoid receptor 1
Type:G Protein-Coupled Receptor (GPCR)
Mol. Mass.:52868.96
Organism:Homo sapiens (Human)
Description:P21554
Residue:472
BDBM50303551
NameBDBM50303551
Synonyms:3-(2-(3-(2,2,3,3-Tetramethylcyclopropanecarbonyl)-1H-indol-1-yl)ethyl)oxazolidin-2-one | CHEMBL584742
TypeSmall organic molecule
Emp. Form.C21H26N2O3
Mol. Mass.354.4427
SMILESCC1(C)C(C(=O)c2cn(CCN3CCOC3=O)c3ccccc23)C1(C)C