Reaction Details
TargetCannabinoid receptor 1
LigandBDBM21284
Substrate/Competitorn/a
Meas. Tech.ChEMBL_596096 (CHEMBL1040884)
EC50 12±n/a nM
Citation Frost, JMDart, MJTietje, KRGarrison, TRGrayson, GKDaza, AVEl-Kouhen, OFYao, BBHsieh, GCPai, MZhu, CZChandran, PMeyer, MD Indol-3-ylcycloalkyl ketones: effects of N1 substituted indole side chain variations on CB(2) cannabinoid receptor activity. J Med Chem53:295-315 (2010) 
 
Cannabinoid receptor 1
Name:Cannabinoid receptor 1
Type:G Protein-Coupled Receptor (GPCR)
Mol. Mass.:52856.55
Organism:Rattus norvegicus (rat)
Description:P20272
Residue:473
BDBM21284
NameBDBM21284
Synonyms:1-(oxan-4-ylmethyl)-3-[(2,2,3,3-tetramethylcyclopropyl)carbonyl]-1H-indole | Tetrahydropyranyl-methyl analogue, 5
TypeSmall organic molecule
Emp. Form.C22H29NO2
Mol. Mass.339.4712
SMILESCC1(C)C(C(=O)c2cn(CC3CCOCC3)c3ccccc23)C1(C)C