Reaction Details
TargetCannabinoid receptor 2
LigandBDBM50303567
Substrate/Competitorn/a
Meas. Tech.ChEMBL_596087 (CHEMBL1040875)
Ki 5.9±n/a nM
Citation Frost, JMDart, MJTietje, KRGarrison, TRGrayson, GKDaza, AVEl-Kouhen, OFYao, BBHsieh, GCPai, MZhu, CZChandran, PMeyer, MD Indol-3-ylcycloalkyl ketones: effects of N1 substituted indole side chain variations on CB(2) cannabinoid receptor activity. J Med Chem53:295-315 (2010) 
 
Cannabinoid receptor 2
Name:Cannabinoid receptor 2
Type:G Protein-Coupled Receptor (GPCR)
Mol. Mass.:39690.94
Organism:Homo sapiens (Human)
Description:P34972
Residue:360
BDBM50303567
NameBDBM50303567
Synonyms:(1-(2-(Pyrrolidin-1-yl)ethyl)-1H-indol-3-yl)(2,2,3,3-tetramethylcyclopropyl)methanone p-Toluenesulfonic Acid | CHEMBL568807
TypeSmall organic molecule
Emp. Form.C22H30N2O
Mol. Mass.338.4864
SMILESCC1(C)C(C(=O)c2cn(CCN3CCCC3)c3ccccc23)C1(C)C