Reaction Details
TargetCannabinoid receptor 2
LigandBDBM50303570
Substrate/Competitorn/a
Meas. Tech.ChEMBL_596087 (CHEMBL1040875)
Ki 5.9±n/a nM
Citation Frost, JMDart, MJTietje, KRGarrison, TRGrayson, GKDaza, AVEl-Kouhen, OFYao, BBHsieh, GCPai, MZhu, CZChandran, PMeyer, MD Indol-3-ylcycloalkyl ketones: effects of N1 substituted indole side chain variations on CB(2) cannabinoid receptor activity. J Med Chem53:295-315 (2010) 
 
Cannabinoid receptor 2
Name:Cannabinoid receptor 2
Type:G Protein-Coupled Receptor (GPCR)
Mol. Mass.:39690.94
Organism:Homo sapiens (Human)
Description:P34972
Residue:360
BDBM50303570
NameBDBM50303570
Synonyms:(2-Oxatricyclo[3.3.1.13,7]dec-1-yl)-[1-(tetrahydropyran-4-ylmethyl)-1H-indol-3-yl]methanone | CHEMBL569992
TypeSmall organic molecule
Emp. Form.C24H29NO3
Mol. Mass.379.492
SMILESO=C(c1cn(CC2CCOCC2)c2ccccc12)C12CC3CC(CC(C3)O1)C2