Reaction Details
TargetFatty-acid amide hydrolase 1
LigandBDBM50157122
Substrate/Competitorn/a
Meas. Tech.ChEMBL_596242 (CHEMBL1048018)
Ki 3±n/a nM
Citation Mileni, MGarfunkle, JEzzili, CKimball, FSCravatt, BFStevens, RCBoger, DL X-ray crystallographic analysis of alpha-ketoheterocycle inhibitors bound to a humanized variant of fatty acid amide hydrolase. J Med Chem53:230-40 (2010) 
 
Fatty-acid amide hydrolase 1
Name:Fatty-acid amide hydrolase 1
Type:Protein
Mol. Mass.:63071.19
Organism:Homo sapiens (Human)
Description:O00519
Residue:579
BDBM50157122
NameBDBM50157122
Synonyms:(Z)-1-(5-(pyridin-2-yl)oxazol-2-yl)octadec-9-en-1-one 1-(5-(pyridin-2-yl)oxazol-2-yl)octadec-9-en-1-one CHEMBL426230
TypeSmall organic molecule
Emp. Form.C26H38N2O2
Mol. Mass.410.5921
SMILESCCCCCCCC\C=C/CCCCCCCC(=O)c1ncc(o1)-c1ccccn1