Reaction Details
TargetMitogen-activated protein kinase 14
LigandBDBM50303586
Substrate/Competitorn/a
Meas. Tech.ChEMBL_596266 (CHEMBL1050682)
IC50 150±n/a nM
Citation Klüter, SGrütter, CNaqvi, TRabiller, MSimard, JRPawar, VGetlik, MRauh, D Displacement assay for the detection of stabilizers of inactive kinase conformations. J Med Chem53:357-67 (2010) 
 
Mitogen-activated protein kinase 14
Name:Mitogen-activated protein kinase 14
Type:Serine/threonine-protein kinase
Mol. Mass.:41286.76
Organism:Homo sapiens (Human)
Description:Q16539
Residue:360
BDBM50303586
NameBDBM50303586
Synonyms:1-(3-tert-Butyl-1-(3-nitrophenyl)-1H-pyrazol-5-yl)-3-(naphthalen-1-yl)urea, 1d CHEMBL578172
TypeSmall organic molecule
Emp. Form.C24H23N5O3
Mol. Mass.429.4711
SMILESCC(C)(C)c1cc(NC(=O)Nc2cccc3ccccc23)n(n1)-c1cccc(c1)[N+]([O-])=O