Reaction Details
TargetMitogen-activated protein kinase 14
LigandBDBM50303596
Substrate/Competitorn/a
Meas. Tech.ChEMBL_596266 (CHEMBL1050682)
IC50 140±n/a nM
Citation Klüter, SGrütter, CNaqvi, TRabiller, MSimard, JRPawar, VGetlik, MRauh, D Displacement assay for the detection of stabilizers of inactive kinase conformations. J Med Chem53:357-67 (2010) 
 
Mitogen-activated protein kinase 14
Name:Mitogen-activated protein kinase 14
Type:Serine/threonine-protein kinase
Mol. Mass.:41286.76
Organism:Homo sapiens (Human)
Description:Q16539
Residue:360
BDBM50303596
NameBDBM50303596
Synonyms:CHEMBL566100 | N-(4-(3-(3-(3-tert-butyl-1-p-tolyl-1H-pyrazol-5-yl)ureido)phenylamino)quinolin-6-yl)propionamide
TypeSmall organic molecule
Emp. Form.C33H35N7O2
Mol. Mass.561.6767
SMILESCCC(=O)Nc1ccc2nccc(Nc3cccc(NC(=O)Nc4cc(nn4-c4ccc(C)cc4)C(C)(C)C)c3)c2c1