Reaction Details
TargetMitogen-activated protein kinase 9
LigandBDBM31825
Substrate/Competitorn/a
Meas. Tech.ChEMBL_596268 (CHEMBL1050684)
IC50 90±n/a nM
Citation Klüter, SGrütter, CNaqvi, TRabiller, MSimard, JRPawar, VGetlik, MRauh, D Displacement assay for the detection of stabilizers of inactive kinase conformations. J Med Chem53:357-67 (2010) 
 
Mitogen-activated protein kinase 9
Name:Mitogen-activated protein kinase 9
Type:Enzyme
Mol. Mass.:48131.49
Organism:Homo sapiens (Human)
Description:JNK-2 was purchased from Upstate Cell Signaling Solutions (formerly Upstate Biotechnology).
Residue:424
BDBM31825
NameBDBM31825
Synonyms:1-(1-(3-Aminophenyl)-3-tert-butyl-1H-pyrazol-5-yl)-3-(4-chlorophenyl)urea, 1c | pyrazolourea, 1b
TypeSmall organic molecule
Emp. Form.C24H25N5O
Mol. Mass.399.4882
SMILESCC(C)(C)c1cc(NC(=O)Nc2cccc3ccccc23)n(n1)-c1cccc(N)c1