Reaction Details
TargetMitogen-activated protein kinase 9
LigandBDBM50303591
Substrate/Competitorn/a
Meas. Tech.ChEMBL_596267 (CHEMBL1050683)
IC50 100±n/a nM
Citation Klüter, SGrütter, CNaqvi, TRabiller, MSimard, JRPawar, VGetlik, MRauh, D Displacement assay for the detection of stabilizers of inactive kinase conformations. J Med Chem53:357-67 (2010) 
 
Mitogen-activated protein kinase 9
Name:Mitogen-activated protein kinase 9
Type:Enzyme
Mol. Mass.:48131.49
Organism:Homo sapiens (Human)
Description:JNK-2 was purchased from Upstate Cell Signaling Solutions (formerly Upstate Biotechnology).
Residue:424
BDBM50303591
NameBDBM50303591
Synonyms:1-(4-(6-aminoquinolin-4-ylamino)phenyl)-3-(3-tert-butyl-1-m-tolyl-1H-pyrazol-5-yl)urea CHEMBL570904
TypeSmall organic molecule
Emp. Form.C30H31N7O
Mol. Mass.505.6134
SMILESCc1cccc(c1)-n1nc(cc1NC(=O)Nc1ccc(Nc2ccnc3ccc(N)cc23)cc1)C(C)(C)C