Reaction Details
TargetMitogen-activated protein kinase 9
LigandBDBM50303597
Substrate/Competitorn/a
Meas. Tech.ChEMBL_596267 (CHEMBL1050683)
IC50 220±n/a nM
Citation Klüter, SGrütter, CNaqvi, TRabiller, MSimard, JRPawar, VGetlik, MRauh, D Displacement assay for the detection of stabilizers of inactive kinase conformations. J Med Chem53:357-67 (2010) 
 
Mitogen-activated protein kinase 9
Name:Mitogen-activated protein kinase 9
Type:Enzyme
Mol. Mass.:48131.49
Organism:Homo sapiens (Human)
Description:JNK-2 was purchased from Upstate Cell Signaling Solutions (formerly Upstate Biotechnology).
Residue:424
BDBM50303597
NameBDBM50303597
Synonyms:(S)-2-(2-amino-3-phenylpropylamino)-3-methyl-5-(naphthalen-2-yl)-6-(pyridin-4-yl)pyrimidin-4(3H)-one CHEMBL585902 | US9187470, 47 (AMG-548)
TypeSmall organic molecule
Emp. Form.C29H27N5O
Mol. Mass.461.5576
SMILESCn1c(NC[C@@H](N)Cc2ccccc2)nc(-c2ccncc2)c(-c2ccc3ccccc3c2)c1=O