Reaction Details
TargetDelta-type opioid receptor
LigandBDBM50303598
Substrate/Competitorn/a
Meas. Tech.ChEMBL_596275 (CHEMBL1050691)
Ki 67±n/a nM
Citation Decker, MSi, YGKnapp, BIBidlack, JMNeumeyer, JL Synthesis and opioid receptor binding affinities of 2-substituted and 3-aminomorphinans: ligands for mu, kappa, and delta opioid receptors. J Med Chem53:402-18 (2010) 
 
Delta-type opioid receptor
Name:Delta-type opioid receptor
Type:G Protein-Coupled Receptor (GPCR)
Mol. Mass.:40382.98
Organism:Homo sapiens (Human)
Description:Competition binding assays were carried out using membrane preparations from transfected HN9.10 cells that constitutively expressed the delta opioid receptor.
Residue:372
BDBM50303598
NameBDBM50303598
Synonyms:17-(Cyclobutylmethyl)morphinan-3-yl 4-Iodophenyl Carbamate | CHEMBL570654
TypeSmall organic molecule
Emp. Form.C28H33IN2O2
Mol. Mass.556.4783
SMILESIc1ccc(NC(=O)Oc2ccc3C[C@@H]4[C@@H]5CCCC[C@]5(CCN4CC4CCC4)c3c2)cc1