Reaction Details
TargetKappa-type opioid receptor
LigandBDBM50303628
Substrate/Competitorn/a
Meas. Tech.ChEMBL_596274 (CHEMBL1050690)
Ki 0.340000±n/a nM
Citation Decker, MSi, YGKnapp, BIBidlack, JMNeumeyer, JL Synthesis and opioid receptor binding affinities of 2-substituted and 3-aminomorphinans: ligands for mu, kappa, and delta opioid receptors. J Med Chem53:402-18 (2010) 
 
Kappa-type opioid receptor
Name:Kappa-type opioid receptor
Type:G Protein-Coupled Receptor (GPCR)
Mol. Mass.:42648.76
Organism:Homo sapiens (Human)
Description:P41145
Residue:380
BDBM50303628
NameBDBM50303628
Synonyms:CHEMBL571998 | N-Benzyl-17-(cyclopropylmethyl)morphinan-3-amine
TypeSmall organic molecule
Emp. Form.C27H34N2
Mol. Mass.386.5723
SMILESC(Nc1ccc2C[C@@H]3[C@@H]4CCCC[C@]4(CCN3CC3CC3)c2c1)c1ccccc1