Reaction Details
TargetKappa-type opioid receptor
LigandBDBM50303598
Substrate/Competitorn/a
Meas. Tech.ChEMBL_596274 (CHEMBL1050690)
Ki 0.990000±n/a nM
Citation Decker, MSi, YGKnapp, BIBidlack, JMNeumeyer, JL Synthesis and opioid receptor binding affinities of 2-substituted and 3-aminomorphinans: ligands for mu, kappa, and delta opioid receptors. J Med Chem53:402-18 (2010) 
 
Kappa-type opioid receptor
Name:Kappa-type opioid receptor
Type:G Protein-Coupled Receptor (GPCR)
Mol. Mass.:42648.76
Organism:Homo sapiens (Human)
Description:P41145
Residue:380
BDBM50303598
NameBDBM50303598
Synonyms:17-(Cyclobutylmethyl)morphinan-3-yl 4-Iodophenyl Carbamate | CHEMBL570654
TypeSmall organic molecule
Emp. Form.C28H33IN2O2
Mol. Mass.556.4783
SMILESIc1ccc(NC(=O)Oc2ccc3C[C@@H]4[C@@H]5CCCC[C@]5(CCN4CC4CCC4)c3c2)cc1