Reaction Details
TargetKappa-type opioid receptor
LigandBDBM50303602
Substrate/Competitorn/a
Meas. Tech.ChEMBL_596274 (CHEMBL1050690)
Ki 12±n/a nM
Citation Decker, MSi, YGKnapp, BIBidlack, JMNeumeyer, JL Synthesis and opioid receptor binding affinities of 2-substituted and 3-aminomorphinans: ligands for mu, kappa, and delta opioid receptors. J Med Chem53:402-18 (2010) 
 
Kappa-type opioid receptor
Name:Kappa-type opioid receptor
Type:G Protein-Coupled Receptor (GPCR)
Mol. Mass.:42648.76
Organism:Homo sapiens (Human)
Description:P41145
Residue:380
BDBM50303602
NameBDBM50303602
Synonyms:CHEMBL569725 | N-[17-(Cyclopropylmethyl)morphinan-3-yl]-N'-(4-iodophenyl)-urea
TypeSmall organic molecule
Emp. Form.C27H32IN3O
Mol. Mass.541.467
SMILESIc1ccc(NC(=O)Nc2ccc3C[C@@H]4[C@@H]5CCCC[C@]5(CCN4CC4CC4)c3c2)cc1