Reaction Details
TargetKappa-type opioid receptor
LigandBDBM50303612
Substrate/Competitorn/a
Meas. Tech.ChEMBL_596274 (CHEMBL1050690)
Ki 37±n/a nM
Citation Decker, MSi, YGKnapp, BIBidlack, JMNeumeyer, JL Synthesis and opioid receptor binding affinities of 2-substituted and 3-aminomorphinans: ligands for mu, kappa, and delta opioid receptors. J Med Chem53:402-18 (2010) 
 
Kappa-type opioid receptor
Name:Kappa-type opioid receptor
Type:G Protein-Coupled Receptor (GPCR)
Mol. Mass.:42648.76
Organism:Homo sapiens (Human)
Description:P41145
Residue:380
BDBM50303612
NameBDBM50303612
Synonyms:1,6-N,N-Bis(17-N-cyclobutylmethyl-3-hydroxymorphinan-2-methylamino)hexane-1,6-diamine | CHEMBL569313
TypeSmall organic molecule
Emp. Form.C50H74N4O2
Mol. Mass.763.1482
SMILESOc1cc2c(C[C@@H]3[C@@H]4CCCC[C@]24CCN3CC2CCC2)cc1CNCCCCCCNCc1cc2C[C@@H]3[C@@H]4CCCC[C@]4(CCN3CC3CCC3)c2cc1O