Reaction Details
TargetKappa-type opioid receptor
LigandBDBM50303616
Substrate/Competitorn/a
Meas. Tech.ChEMBL_596274 (CHEMBL1050690)
Ki 72±n/a nM
Citation Decker, MSi, YGKnapp, BIBidlack, JMNeumeyer, JL Synthesis and opioid receptor binding affinities of 2-substituted and 3-aminomorphinans: ligands for mu, kappa, and delta opioid receptors. J Med Chem53:402-18 (2010) 
 
Kappa-type opioid receptor
Name:Kappa-type opioid receptor
Type:G Protein-Coupled Receptor (GPCR)
Mol. Mass.:42648.76
Organism:Homo sapiens (Human)
Description:P41145
Residue:380
BDBM50303616
NameBDBM50303616
Synonyms:(rac)-2-(1-Hydroxypropyl)-3-hydroxy-17-N-cyclobutylmethylmorphinan | CHEMBL584530
TypeSmall organic molecule
Emp. Form.C24H35NO2
Mol. Mass.369.5402
SMILESCCC(O)c1cc2C[C@@H]3[C@@H]4CCCC[C@]4(CCN3CC3CCC3)c2cc1O