Reaction Details
TargetMu-type opioid receptor
LigandBDBM50135800
Substrate/Competitorn/a
Meas. Tech.ChEMBL_596273 (CHEMBL1050689)
Ki 0.062000±n/a nM
Citation Decker, MSi, YGKnapp, BIBidlack, JMNeumeyer, JL Synthesis and opioid receptor binding affinities of 2-substituted and 3-aminomorphinans: ligands for mu, kappa, and delta opioid receptors. J Med Chem53:402-18 (2010) 
 
Mu-type opioid receptor
Name:Mu-type opioid receptor
Type:G Protein-Coupled Receptor (GPCR)
Mol. Mass.:44789.51
Organism:Homo sapiens (Human)
Description:P35372
Residue:400
BDBM50135800
NameBDBM50135800
Synonyms:(-)-3-Hydroxy-N-cycloproypylmethylmorphinan Mandelate 3-Hydroxy-N-cyclopropylmethylmorphinan CYCLORPHAN US10736890, Compound TABLE B.6 US9656961, Example 00123
TypeSmall organic molecule
Emp. Form.C20H27NO
Mol. Mass.297.4345
SMILESOc1ccc2C[C@@H]3[C@@H]4CCCC[C@]4(CCN3CC3CC3)c2c1