Reaction Details
TargetMu-type opioid receptor
LigandBDBM50303600
Substrate/Competitorn/a
Meas. Tech.ChEMBL_596273 (CHEMBL1050689)
Ki 3.9±n/a nM
Citation Decker, MSi, YGKnapp, BIBidlack, JMNeumeyer, JL Synthesis and opioid receptor binding affinities of 2-substituted and 3-aminomorphinans: ligands for mu, kappa, and delta opioid receptors. J Med Chem53:402-18 (2010) 
 
Mu-type opioid receptor
Name:Mu-type opioid receptor
Type:G Protein-Coupled Receptor (GPCR)
Mol. Mass.:44789.51
Organism:Homo sapiens (Human)
Description:P35372
Residue:400
BDBM50303600
NameBDBM50303600
Synonyms:CHEMBL571561 | N-[17-(Cyclopropylmethyl)morphinan-3-yl]-N'-phenylurea
TypeSmall organic molecule
Emp. Form.C27H33N3O
Mol. Mass.415.5704
SMILESO=C(Nc1ccccc1)Nc1ccc2C[C@@H]3[C@@H]4CCCC[C@]4(CCN3CC3CC3)c2c1