Reaction Details
TargetMu-type opioid receptor
LigandBDBM50303603
Substrate/Competitorn/a
Meas. Tech.ChEMBL_596273 (CHEMBL1050689)
Ki 24±n/a nM
Citation Decker, MSi, YGKnapp, BIBidlack, JMNeumeyer, JL Synthesis and opioid receptor binding affinities of 2-substituted and 3-aminomorphinans: ligands for mu, kappa, and delta opioid receptors. J Med Chem53:402-18 (2010) 
 
Mu-type opioid receptor
Name:Mu-type opioid receptor
Type:G Protein-Coupled Receptor (GPCR)
Mol. Mass.:44789.51
Organism:Homo sapiens (Human)
Description:P35372
Residue:400
BDBM50303603
NameBDBM50303603
Synonyms:CHEMBL572216 | N-[17-(Cyclobutylmethyl)morphinan-3-yl]-N'-(4-iodophenyl)-urea
TypeSmall organic molecule
Emp. Form.C28H34IN3O
Mol. Mass.555.4935
SMILESIc1ccc(NC(=O)Nc2ccc3C[C@@H]4[C@@H]5CCCC[C@]5(CCN4CC4CCC4)c3c2)cc1