Reaction Details
TargetProstaglandin E2 receptor EP3 subtype
LigandBDBM50303682
Substrate/Competitorn/a
Meas. Tech.ChEMBL_596837 (CHEMBL1042648)
IC50 2.5±n/a nM
Citation Singh, JZeller, WZhou, NHategan, GMishra, RKPolozov, AYu, POnua, EZhang, JRamírez, JLSigthorsson, GThorsteinnsdottir, MKiselyov, ASZembower, DEAndrésson, TGurney, ME Structure-activity relationship studies leading to the identification of (2E)-3-[l-[(2,4-dichlorophenyl)methyl]-5-fluoro-3-methyl-lH-indol-7-yl]-N-[(4,5-dichloro-2-thienyl)sulfonyl]-2-propenamide (DG-041), a potent and selective prostanoid EP3 receptor antagonist, as a novel antiplatelet agent that J Med Chem53:18-36 (2010) 
 
Prostaglandin E2 receptor EP3 subtype
Name:Prostaglandin E2 receptor EP3 subtype
Type:Enzyme
Mol. Mass.:43335.03
Organism:Homo sapiens (Human)
Description:P43115
Residue:390
BDBM50303682
NameBDBM50303682
Synonyms:4,5-Dichloro-thiophene-2-sulfonic acid{3-[5-fluoro-3-methyl-7-(naphthalen-2-yloxy)-indol-1-yl]-propionyl}-amide | CHEMBL584492
TypeSmall organic molecule
Emp. Form.C26H18Cl2N2O3S2
Mol. Mass.541.469
SMILESClc1cc(sc1Cl)S(=O)(=O)NC(=O)\C=C\c1cccc2[nH]cc(Cc3ccc4ccccc4c3)c12