Reaction Details
TargetEgl nine homolog 1
LigandBDBM26106
Substrate/Competitorn/a
Meas. Tech.ChEMBL_597532 (CHEMBL1047007)
Kd 2800±n/a nM
Citation Leung, IKFlashman, EYeoh, KKSchofield, CJClaridge, TD Using NMR solvent water relaxation to investigate metalloenzyme-ligand binding interactions. J Med Chem53:867-75 (2010) 
 
Egl nine homolog 1
Name:Egl nine homolog 1
Type:Protein
Mol. Mass.:46035.59
Organism:Homo sapiens (Human)
Description:Q9GZT9
Residue:426
BDBM26106
NameBDBM26106
Synonyms:CHEMBL90852 NOG [(carboxymethyl)carbamoyl]formic acid
TypeSmall organic molecule
Emp. Form.C4H5NO5
Mol. Mass.147.0862
SMILESOC(=O)CNC(=O)C(O)=O