Reaction Details
TargetNeuroendocrine convertase 2
LigandBDBM50303776
Substrate/Competitorn/a
Meas. Tech.ChEMBL_597568 (CHEMBL1049705)
Ki 55±n/a nM
Citation Becker, GLSielaff, FThan, MELindberg, IRouthier, SDay, RLu, YGarten, WSteinmetzer, T Potent inhibitors of furin and furin-like proprotein convertases containing decarboxylated P1 arginine mimetics. J Med Chem53:1067-75 (2010) 
 
Neuroendocrine convertase 2
Name:Neuroendocrine convertase 2
Type:PROTEIN
Mol. Mass.:70563.93
Organism:Homo sapiens (Human)
Description:ChEMBL_1290738
Residue:638
BDBM50303776
NameBDBM50303776
Synonyms:CHEMBL568525 | N-((6S,9S,12S)-1,17-diamino-6-(4-carbamimidoylbenzylcarbamoyl)-1,17-diimino-9-isopropyl-8,11-dioxo-2,7,10,16-tetraazaheptadecan-12-yl)decanamide
TypeSmall organic molecule
Emp. Form.C35H62N12O4
Mol. Mass.714.9448
SMILES[#6]-[#6]-[#6]-[#6]-[#6]-[#6]-[#6]-[#6]-[#6]-[#6](=O)-[#7]-[#6@@H](-[#6]-[#6]-[#6]\[#7]=[#6](/[#7])-[#7])-[#6](=O)-[#7]-[#6@@H](-[#6](-[#6])-[#6])-[#6](=O)-[#7]-[#6@@H](-[#6]-[#6]-[#6]\[#7]=[#6](/[#7])-[#7])-[#6](=O)-[#7]-[#6]-c1ccc(cc1)-[#6](-[#7])=[#7]