Reaction Details
TargetProprotein convertase subtilisin/kexin type 5
LigandBDBM50303778
Substrate/Competitorn/a
Meas. Tech.ChEMBL_597565 (CHEMBL1049702)
Ki 173±n/a nM
Citation Becker, GLSielaff, FThan, MELindberg, IRouthier, SDay, RLu, YGarten, WSteinmetzer, T Potent inhibitors of furin and furin-like proprotein convertases containing decarboxylated P1 arginine mimetics. J Med Chem53:1067-75 (2010) 
 
Proprotein convertase subtilisin/kexin type 5
Name:Proprotein convertase subtilisin/kexin type 5
Type:PROTEIN
Mol. Mass.:206919.79
Organism:Homo sapiens (Human)
Description:ChEMBL_597565
Residue:1860
BDBM50303778
NameBDBM50303778
Synonyms:(S)-N-((1-carbamimidoylpiperidin-4-yl)methyl)-5-guanidino-2-((S)-2-((S)-5-guanidino-2-(2-phenylacetamido)pentanamido)-3-methylbutanamido)pentanamide | CHEMBL568067
TypeSmall organic molecule
Emp. Form.C32H55N13O4
Mol. Mass.685.8638
SMILES[#6]-[#6](-[#6])-[#6@H](-[#7]-[#6](=O)-[#6@H](-[#6]-[#6]-[#6]\[#7]=[#6](/[#7])-[#7])-[#7]-[#6](=O)-[#6]-c1ccccc1)-[#6](=O)-[#7]-[#6@@H](-[#6]-[#6]-[#6]\[#7]=[#6](/[#7])-[#7])-[#6](=O)-[#7]-[#6]-[#6]-1-[#6]-[#6]-[#7](-[#6]-[#6]-1)-[#6](-[#7])=[#7]