Reaction Details
TargetProthrombin
LigandBDBM50303778
Substrate/Competitorn/a
Meas. Tech.ChEMBL_597569 (CHEMBL1049706)
Ki 50000±n/a nM
Citation Becker, GLSielaff, FThan, MELindberg, IRouthier, SDay, RLu, YGarten, WSteinmetzer, T Potent inhibitors of furin and furin-like proprotein convertases containing decarboxylated P1 arginine mimetics. J Med Chem53:1067-75 (2010) 
 
Prothrombin
Name:Prothrombin
Type:Protein
Mol. Mass.:70029.57
Organism:Homo sapiens (Human)
Description:P00734
Residue:622
BDBM50303778
NameBDBM50303778
Synonyms:(S)-N-((1-carbamimidoylpiperidin-4-yl)methyl)-5-guanidino-2-((S)-2-((S)-5-guanidino-2-(2-phenylacetamido)pentanamido)-3-methylbutanamido)pentanamide | CHEMBL568067
TypeSmall organic molecule
Emp. Form.C32H55N13O4
Mol. Mass.685.8638
SMILES[#6]-[#6](-[#6])-[#6@H](-[#7]-[#6](=O)-[#6@H](-[#6]-[#6]-[#6]\[#7]=[#6](/[#7])-[#7])-[#7]-[#6](=O)-[#6]-c1ccccc1)-[#6](=O)-[#7]-[#6@@H](-[#6]-[#6]-[#6]\[#7]=[#6](/[#7])-[#7])-[#6](=O)-[#7]-[#6]-[#6]-1-[#6]-[#6]-[#7](-[#6]-[#6]-1)-[#6](-[#7])=[#7]