Reaction Details
TargetFurin
LigandBDBM50303784
Substrate/Competitorn/a
Meas. Tech.ChEMBL_597562 (CHEMBL1049699)
Ki 7490±n/a nM
Citation Becker, GLSielaff, FThan, MELindberg, IRouthier, SDay, RLu, YGarten, WSteinmetzer, T Potent inhibitors of furin and furin-like proprotein convertases containing decarboxylated P1 arginine mimetics. J Med Chem53:1067-75 (2010) 
 
Furin
Name:Furin
Type:Enzyme Catalytic Domain
Mol. Mass.:86676.01
Organism:Homo sapiens (Human)
Description:P09958
Residue:794
BDBM50303784
NameBDBM50303784
Synonyms:(S)-N-(4-aminobutyl)-5-guanidino-2-((S)-2-((S)-5-guanidino-2-(2-phenylacetamido)pentanamido)-3-methylbutanamido)pentanamide | CHEMBL569686
TypeSmall organic molecule
Emp. Form.C29H51N11O4
Mol. Mass.617.7865
SMILES[#6]-[#6](-[#6])-[#6@H](-[#7]-[#6](=O)-[#6@H](-[#6]-[#6]-[#6]\[#7]=[#6](/[#7])-[#7])-[#7]-[#6](=O)-[#6]-c1ccccc1)-[#6](=O)-[#7]-[#6@@H](-[#6]-[#6]-[#6]\[#7]=[#6](/[#7])-[#7])-[#6](=O)-[#7]-[#6]-[#6]-[#6]-[#6]-[#7]